Target
Gamma-aminobutyric acid receptor subunit alpha-1/beta-3/gamma-2
Ligand
BDBM50007554
Substrate
Meas. Tech.
ChEMBL_70099 (CHEMBL678329)
Ki
0.49±n/a nM
Citation
 Huang, QHe, XMa, CLiu, RYu, SDayer, CAWenger, GRMcKernan, RCook, JM Pharmacophore/receptor models for GABA(A)/BzR subtypes (alpha1beta3gamma2, alpha5beta3gamma2, and alpha6beta3gamma2) via a comprehensive ligand-mapping approach. J Med Chem 43:71-95 (2000)  
Target
Name:
Gamma-aminobutyric acid receptor subunit alpha-1/beta-3/gamma-2
Synonyms:
GABA receptor alpha-1/beta-3/gamma-2 subunit GABAA alpha1beta3gamma2
Type:
Protein
Mol. Mass.:
Description:
Components:
This complex has 3 components.
Component 1
Name:
Gamma-aminobutyric acid receptor subunit alpha-1
Synonyms:
Benzodiazepine central GABA A Benzodiazepine liver GABA(A) receptor subunit alpha-1 GABA-A receptor GBRA1_HUMAN TBPS | agonist GABA site
Type:
Protein
Mol. Mass.:
51817.35
Organism:
Homo sapiens (Human)
Description:
P14867
Residue:
456
  
Component 2
Name:
Gamma-aminobutyric acid receptor subunit beta-3
Synonyms:
GABA A receptor alpha-4/beta-3/gamma-2 GABA-A receptor GBRB3_HUMAN | agonist GABA site
Type:
PROTEIN
Mol. Mass.:
54130.51
Organism:
Homo sapiens (Human)
Description:
ChEMBL_448071
Residue:
473
  
Component 3
Name:
Gamma-aminobutyric acid receptor subunit gamma-2
Synonyms:
GABA(A) receptor subunit gamma-2 GBRG2_HUMAN
Type:
PROTEIN
Mol. Mass.:
54172.74
Organism:
Homo sapiens (Human)
Description:
EBI_217
Residue:
467
  
Inhibitor
Name:
BDBM50007554
Synonyms:
4-Methoxymethyl-6-propoxy-9H-beta-carboline-3-carboxylic acid ethyl ester | CHEMBL49141
Type:
Small organic molecule
Emp. Form.:
C19H22N2O4
Mol. Mass.:
342.389
SMILES:
CCCOc1ccc2[nH]c3cnc(C(=O)OCC)c(COC)c3c2c1
: