Target
GABA-A receptor; alpha-2/beta-3/gamma-2
Ligand
BDBM50067433
Substrate
Meas. Tech.
ChEMBL_70261 (CHEMBL681248)
Ki
88±n/a nM
Citation
 Huang, QHe, XMa, CLiu, RYu, SDayer, CAWenger, GRMcKernan, RCook, JM Pharmacophore/receptor models for GABA(A)/BzR subtypes (alpha1beta3gamma2, alpha5beta3gamma2, and alpha6beta3gamma2) via a comprehensive ligand-mapping approach. J Med Chem 43:71-95 (2000)  
Target
Name:
GABA-A receptor; alpha-2/beta-3/gamma-2
Synonyms:
GABA receptor alpha-2/beta-3/gamma-2 subunit | Gamma-aminobutyric acid receptor subunit alpha-2/beta-3/gamma-2
Type:
Mol. Mass.:
Description:
ASSAY_ID of ChEMBL is 2148174
Components:
This complex has 3 components.
Component 1
Name:
Gamma-aminobutyric acid receptor subunit gamma-2
Synonyms:
GABA(A) receptor subunit gamma-2 GBRG2_HUMAN
Type:
PROTEIN
Mol. Mass.:
54172.74
Organism:
Homo sapiens (Human)
Description:
EBI_217
Residue:
467
  
Component 2
Name:
Gamma-aminobutyric acid receptor subunit beta-3
Synonyms:
GABA A receptor alpha-4/beta-3/gamma-2 GABA-A receptor GBRB3_HUMAN | agonist GABA site
Type:
PROTEIN
Mol. Mass.:
54130.51
Organism:
Homo sapiens (Human)
Description:
ChEMBL_448071
Residue:
473
  
Component 3
Name:
Gamma-aminobutyric acid receptor subunit alpha-2
Synonyms:
GABA receptor alpha-2 subunit GBRA2_HUMAN | Gamma-aminobutyric acid receptor subunit alpha-2 (GABRA2)
Type:
Protein
Mol. Mass.:
51338.78
Organism:
Homo sapiens (Human)
Description:
P47869
Residue:
451
  
Inhibitor
Name:
BDBM50067433
Synonyms:
7-(1-ethynyl)-1-(3-isopropyl-1,2,4-oxadiazol-5-yl)-(12aS)-12,12a-dihydro-9H,11H-azeto[1,2-a]benzo[e]imidazo[5,1-c][1,4]diazepin-9-one | CHEMBL133705
Type:
Small organic molecule
Emp. Form.:
C20H17N5O2
Mol. Mass.:
359.3813
SMILES:
CC(C)c1noc(n1)-c1ncn-2c1[C@@H]1CCN1C(=O)c1cc(ccc-21)C#C
: