Target
Type-1 angiotensin II receptor
Ligand
BDBM50044543
Substrate
Meas. Tech.
ChEMBL_34658 (CHEMBL649717)
Ki
1.4±n/a nM
Citation
 Wintner, EAMoallemi, CC Quantized surface complementarity diversity (QSCD): a model based on small molecule-target complementarity. J Med Chem 43:1993-2006 (2000)  
Target
Name:
Type-1 angiotensin II receptor
Synonyms:
AGTR1 ANGIOTENSIN AT1 Angiotensin II type 1a (AT-1a) receptor
Type:
Enzyme Catalytic Domain
Mol. Mass.:
41009.15
Organism:
RABBIT
Description:
ANGIOTENSIN AT1 AGTR1 RABBIT::P34976
Residue:
359
  
Inhibitor
Name:
BDBM50044543
Synonyms:
5-Butyl-2-(2-isopropyl-phenyl)-4-[2'-(1H-tetrazol-5-yl)-biphenyl-4-ylmethyl]-2,4-dihydro-[1,2,4]triazol-3-one CHEMBL431411
Type:
Small organic molecule
Emp. Form.:
C29H31N7O
Mol. Mass.:
493.6027
SMILES:
CCCCc1nn(-c2ccccc2C(C)C)c(=O)n1Cc1ccc(cc1)-c1ccccc1-c1nnn[nH]1
: