Target
Type-2 angiotensin II receptor
Ligand
BDBM50035441
Substrate
Meas. Tech.
ChEMBL_35418 (CHEMBL643592)
Ki
173±n/a nM
Citation
 Wintner, EAMoallemi, CC Quantized surface complementarity diversity (QSCD): a model based on small molecule-target complementarity. J Med Chem 43:1993-2006 (2000)  
Target
Name:
Type-2 angiotensin II receptor
Synonyms:
AGTR2_RAT Agtr2 Angiotensin II receptor Type-2 angiotensin II receptor
Type:
Enzyme Catalytic Domain
Mol. Mass.:
41346.62
Organism:
RAT
Description:
Angiotensin II AT2 0 0::P35351
Residue:
363
  
Inhibitor
Name:
BDBM50035441
Synonyms:
4'-[3-Butyl-1-(3-nitro-phenyl)-5-oxo-1,5-dihydro-[1,2,4]triazol-4-ylmethyl]-biphenyl-2-sulfonic acid 2-chloro-benzoylamide | CHEMBL293501
Type:
Small organic molecule
Emp. Form.:
C32H28ClN5O6S
Mol. Mass.:
646.113
SMILES:
CCCCc1nn(-c2cccc(c2)[N+]([O-])=O)c(=O)n1Cc1ccc(cc1)-c1ccccc1S(=O)(=O)NC(=O)c1ccccc1Cl
: