Target
Peptide deformylase
Ligand
BDBM50089212
Substrate
Meas. Tech.
ChEMBL_154575 (CHEMBL761923)
IC50
140±n/a nM
Citation
 Apfel, CBanner, DWBur, DDietz, MHirata, THubschwerlen, CLocher, HPage, MGPirson, WRossé, GSpecklin, JL Hydroxamic acid derivatives as potent peptide deformylase inhibitors and antibacterial agents. J Med Chem 43:2324-31 (2000)  
Target
Name:
Peptide deformylase
Synonyms:
3.5.1.88 BON94_18585 D9G11_25760 FORC82_p394 Polypeptide deformylase def | def_2
Type:
Mol. Mass.:
16901.39
Organism:
Escherichia coli
Description:
Residue:
150
  
Inhibitor
Name:
BDBM50089212
Synonyms:
3-Benzenesulfonyl-octanoic acid hydroxyamide | CHEMBL74893
Type:
Small organic molecule
Emp. Form.:
C14H21NO4S
Mol. Mass.:
299.386
SMILES:
CCCCCC(CC(=O)NO)S(=O)(=O)c1ccccc1
: