Target
Peptide deformylase
Ligand
BDBM50089197
Substrate
Meas. Tech.
ChEMBL_154575 (CHEMBL761923)
IC50
100±n/a nM
Citation
 Apfel, CBanner, DWBur, DDietz, MHirata, THubschwerlen, CLocher, HPage, MGPirson, WRossé, GSpecklin, JL Hydroxamic acid derivatives as potent peptide deformylase inhibitors and antibacterial agents. J Med Chem 43:2324-31 (2000)  
Target
Name:
Peptide deformylase
Synonyms:
3.5.1.88 BON94_18585 D9G11_25760 FORC82_p394 Polypeptide deformylase def | def_2
Type:
Mol. Mass.:
16901.39
Organism:
Escherichia coli
Description:
Residue:
150
  
Inhibitor
Name:
BDBM50089197
Synonyms:
3-Benzenesulfinyl-heptanoic acid hydroxyamide | CHEMBL75433
Type:
Small organic molecule
Emp. Form.:
C13H19NO3S
Mol. Mass.:
269.36
SMILES:
CCCCC(CC(=O)NO)S(=O)c1ccccc1
: