Target
Neprilysin
Ligand
BDBM50408913
Substrate
Meas. Tech.
ChEMBL_140878 (CHEMBL752509)
IC50
15000±n/a nM
Citation
 Apfel, CBanner, DWBur, DDietz, MHirata, THubschwerlen, CLocher, HPage, MGPirson, WRossé, GSpecklin, JL Hydroxamic acid derivatives as potent peptide deformylase inhibitors and antibacterial agents. J Med Chem 43:2324-31 (2000)  
Target
Name:
Neprilysin
Synonyms:
Mme Neprilysin Neutral endopeptidase 24.11
Type:
Protein
Mol. Mass.:
85789.59
Organism:
Rattus norvegicus (Rat)
Description:
P07861
Residue:
750
  
Inhibitor
Name:
BDBM50408913
Synonyms:
CHEMBL2092878
Type:
Small organic molecule
Emp. Form.:
C13H19NO4S
Mol. Mass.:
285.359
SMILES:
CCCC[C@@H](CC(=O)NO)S(=O)(=O)c1ccccc1
: