Target
Reverse transcriptase/RNaseH
Ligand
BDBM50369528
Substrate
Meas. Tech.
ChEMBL_197431 (CHEMBL802397)
IC50
40±n/a nM
Citation
 Porcari, ARPtak, RGBorysko, KZBreitenbach, JMDrach, JCTownsend, LB 6-N-Acyltriciribine analogues: structure-activity relationship between acyl carbon chain length and activity against HIV-1. J Med Chem 43:2457-63 (2000)  
Target
Name:
Reverse transcriptase/RNaseH
Synonyms:
HIV-1 Reverse Transcriptase RNase H Reverse transcriptase/RNaseH
Type:
PROTEIN
Mol. Mass.:
65229.15
Organism:
Human immunodeficiency virus 1
Description:
ChEMBL_1473730
Residue:
566
  
Inhibitor
Name:
BDBM50369528
Synonyms:
NSC-154020 | TRICIRIBINE
Type:
Small organic molecule
Emp. Form.:
C13H16N6O4
Mol. Mass.:
320.3039
SMILES:
Cn1nc(N)c2cn([C@@H]3O[C@H](CO)[C@@H](O)[C@H]3O)c3ncnc1c23
: