Target
3',5'-cyclic-AMP phosphodiesterase
Ligand
BDBM14361
Substrate
Meas. Tech.
ChEMBL_155663 (CHEMBL763047)
IC50
3630±n/a nM
Citation
 Watanabe, NAdachi, HTakase, YOzaki, HMatsukura, MMiyazaki, KIshibashi, KIshihara, HKodama, KNishino, MKakiki, MKabasawa, Y 4-(3-Chloro-4-methoxybenzyl)aminophthalazines: synthesis and inhibitory activity toward phosphodiesterase 5. J Med Chem 43:2523-9 (2000)  
Target
Name:
3',5'-cyclic-AMP phosphodiesterase
Synonyms:
Phosphodiesterase 4A
Type:
PROTEIN
Mol. Mass.:
13615.65
Organism:
Sus scrofa
Description:
ChEMBL_155848
Residue:
118
  
Inhibitor
Name:
BDBM14361
Synonyms:
(R,S)-Rolipram 4-[3-(cyclopentyloxy)-4-methoxyphenyl]pyrrolidin-2-one CHEMBL63 | Rolipram
Type:
Small organic molecule
Emp. Form.:
C16H21NO3
Mol. Mass.:
275.3428
SMILES:
COc1ccc(cc1OC1CCCC1)C1CNC(=O)C1
: