Target
Metabotropic glutamate receptor 5
Ligand
BDBM50052553
Substrate
Meas. Tech.
ChEMBL_104277 (CHEMBL711712)
Ki
>1000000±n/a nM
Citation
 Bräuner-Osborne, HEgebjerg, JNielsen, EOMadsen, UKrogsgaard-Larsen, P Ligands for glutamate receptors: design and therapeutic prospects. J Med Chem 43:2609-45 (2000)  
Target
Name:
Metabotropic glutamate receptor 5
Synonyms:
GPRC1E GRM5_HUMAN metabotropic glutamate 5 | metabotropic glutamate 5a
Type:
Enzyme
Mol. Mass.:
132484.72
Organism:
Homo sapiens (Human)
Description:
Residue:
1212
  
Inhibitor
Name:
BDBM50052553
Synonyms:
(2S)-2-aminohexanedioic acid CHEMBL88804 | L-2-aminoadipic acid
Type:
Small organic molecule
Emp. Form.:
C6H11NO4
Mol. Mass.:
161.1558
SMILES:
N[C@@H](CCCC(O)=O)C(O)=O
: