Target
Metabotropic glutamate receptor 5
Ligand
BDBM50052398
Substrate
Meas. Tech.
ChEMBL_104277 (CHEMBL711712)
Ki
>100000±n/a nM
Citation
 Bräuner-Osborne, HEgebjerg, JNielsen, EOMadsen, UKrogsgaard-Larsen, P Ligands for glutamate receptors: design and therapeutic prospects. J Med Chem 43:2609-45 (2000)  
Target
Name:
Metabotropic glutamate receptor 5
Synonyms:
GPRC1E GRM5_HUMAN metabotropic glutamate 5 | metabotropic glutamate 5a
Type:
Enzyme
Mol. Mass.:
132484.72
Organism:
Homo sapiens (Human)
Description:
Residue:
1212
  
Inhibitor
Name:
BDBM50052398
Synonyms:
(2R,4R)-4-aminopyrrolidine-2,4-dicarboxylic acid 2R, 4R-APDC | CHEMBL40086
Type:
Small organic molecule
Emp. Form.:
C6H10N2O4
Mol. Mass.:
174.1546
SMILES:
N[C@]1(CN[C@H](C1)C(O)=O)C(O)=O
: