Target
Metabotropic glutamate receptor 2
Ligand
BDBM17657
Substrate
Meas. Tech.
ChEMBL_106055 (CHEMBL718221)
Ki
12000±n/a nM
Citation
 Bräuner-Osborne, HEgebjerg, JNielsen, EOMadsen, UKrogsgaard-Larsen, P Ligands for glutamate receptors: design and therapeutic prospects. J Med Chem 43:2609-45 (2000)  
Target
Name:
Metabotropic glutamate receptor 2
Synonyms:
GPRC1B GRM2_HUMAN Metabotropic glutamate receptor mGlu2 | metabotropic glutamate 2
Type:
Enzyme
Mol. Mass.:
95584.88
Organism:
Homo sapiens (Human)
Description:
Q14416
Residue:
872
  
Inhibitor
Name:
BDBM17657
Synonyms:
(2S)-2-aminopentanedioic acid D-Glutamate L-Glu L-Glutamic acid L-gluatmate
Type:
Amino Acid
Emp. Form.:
C5H9NO4
Mol. Mass.:
147.1293
SMILES:
N[C@@H](CCC(O)=O)C(O)=O
: