Target
Metabotropic glutamate receptor 2
Ligand
BDBM50030627
Substrate
Meas. Tech.
ChEMBL_106052 (CHEMBL718218)
Ki
51000±n/a nM
Citation
 Bräuner-Osborne, HEgebjerg, JNielsen, EOMadsen, UKrogsgaard-Larsen, P Ligands for glutamate receptors: design and therapeutic prospects. J Med Chem 43:2609-45 (2000)  
Target
Name:
Metabotropic glutamate receptor 2
Synonyms:
GPRC1B GRM2_HUMAN Metabotropic glutamate receptor mGlu2 | metabotropic glutamate 2
Type:
Enzyme
Mol. Mass.:
95584.88
Organism:
Homo sapiens (Human)
Description:
Q14416
Residue:
872
  
Inhibitor
Name:
BDBM50030627
Synonyms:
(+-)-MCPG 4-(1-Amino-1-carboxy-ethyl)-benzoic acid CHEMBL299683 | MCPG
Type:
Small organic molecule
Emp. Form.:
C10H11NO4
Mol. Mass.:
209.1986
SMILES:
CC(N)(C(O)=O)c1ccc(cc1)C(O)=O
: