Target
Metabotropic glutamate receptor 4
Ligand
BDBM50034504
Substrate
Meas. Tech.
ChEMBL_106560 (CHEMBL716502)
Ki
50000±n/a nM
Citation
 Bräuner-Osborne, HEgebjerg, JNielsen, EOMadsen, UKrogsgaard-Larsen, P Ligands for glutamate receptors: design and therapeutic prospects. J Med Chem 43:2609-45 (2000)  
Target
Name:
Metabotropic glutamate receptor 4
Synonyms:
GPRC1D GRM4_HUMAN MGLUR4 Metabotropic glutamate receptor 4 (mGlu4) metabotropic glutamate 4
Type:
Protein
Mol. Mass.:
101899.95
Organism:
Homo sapiens (Human)
Description:
Q14833
Residue:
912
  
Inhibitor
Name:
BDBM50034504
Synonyms:
(1S,2S)-2-((S)-Amino-carboxy-methyl)-cyclopropanecarboxylic acid 2-(Amino-carboxy-methyl)-cyclopropanecarboxylic acid(2S,3S,4S-CCG) L-CCGI
Type:
Small organic molecule
Emp. Form.:
C6H9NO4
Mol. Mass.:
159.14
SMILES:
N[C@@H]([C@H]1C[C@@H]1C(O)=O)C(O)=O
: