Target
Kappa-type opioid receptor
Ligand
BDBM50090003
Substrate
Meas. Tech.
ChEMBL_147239 (CHEMBL755507)
Ki
0.150000±n/a nM
Citation
 Schlechtingen, GZhang, LMaycock, ADeHaven, RNDaubert, JDCassel, JChung, NNSchiller, PWGoodman, M [Pro(3)]Dyn A(1-11)-NH(2): a dynorphin analogue with high selectivity for the kappa opioid receptor. J Med Chem 43:2698-702 (2000)  
Target
Name:
Kappa-type opioid receptor
Synonyms:
K-OR-1 Kappa-opioid receptor (KOR) Kappa-type opioid receptor (KOR) OPIATE Kappa OPRK1 kappa opioid receptor (KOR)
Type:
G Protein-Coupled Receptor (GPCR)
Mol. Mass.:
42648.76
Organism:
Homo sapiens (Human)
Description:
P41145
Residue:
380
  
Inhibitor
Name:
BDBM50090003
Synonyms:
CHEMBL405190 [D-Ala-3] Dynorphin A (1-11)-NH2H-Tyr-Gly-D-Ala-Phe-Leu-Arg-Arg-Ile-Arg-Pro-Lys-NH2
Type:
Small organic molecule
Emp. Form.:
C64H106N22O12
Mol. Mass.:
1375.6666
SMILES:
CC[C@H](C)[C@H](NC(=O)[C@H](CCCNC(N)=N)NC(=O)[C@H](CCCNC(N)=N)NC(=O)[C@H](CC(C)C)NC(=O)[C@H](Cc1ccccc1)NC(=O)[C@@H](C)NC(=O)CNC(=O)[C@@H](N)Cc1ccc(O)cc1)C(=O)N[C@@H](CCCNC(N)=N)C(=O)N1CCC[C@@H]1C(=O)N[C@@H](CCCCN)C(N)=O
: