Target
Adenosine receptor A3
Ligand
BDBM50009552
Substrate
Meas. Tech.
ChEMBL_31246 (CHEMBL642211)
Ki
25±n/a nM
Citation
 Ferrarini, PLMori, CManera, CMartinelli, AMori, FSaccomanni, GBarili, PLBetti, LGiannaccini, GTrincavelli, LLucacchini, A A novel class of highly potent and selective A1 adenosine antagonists: structure-affinity profile of a series of 1,8-naphthyridine derivatives. J Med Chem 43:2814-23 (2000)  
Target
Name:
Adenosine receptor A3
Synonyms:
AA3R_RAT Adenosine receptor A2a and A3 | Adora3
Type:
PROTEIN
Mol. Mass.:
36643.73
Organism:
Rattus norvegicus
Description:
ChEMBL_479910
Residue:
320
  
Inhibitor
Name:
BDBM50009552
Synonyms:
2-[6-Amino-2-(2-morpholin-4-yl-ethylamino)-purin-9-yl]-5-hydroxymethyl-tetrahydro-furan-3,4-diol CHEMBL45891 | N6-Cyclohexylado (CHA)
Type:
Small organic molecule
Emp. Form.:
C16H23N5O4
Mol. Mass.:
349.3849
SMILES:
OC[C@H]1O[C@H]([C@H](O)[C@@H]1O)n1cnc2c(NC3CCCCC3)ncnc12
: