Target
Nitric oxide synthase, brain
Ligand
BDBM50090926
Substrate
Meas. Tech.
ChEMBL_223228 (CHEMBL843812)
Ki
350±n/a nM
Citation
 Huang, HMartásek, PRoman, LJSilverman, RB Synthesis and evaluation of peptidomimetics as selective inhibitors and active site probes of nitric oxide synthases. J Med Chem 43:2938-45 (2000)  
Target
Name:
Nitric oxide synthase, brain
Synonyms:
Constitutive NOS NC-NOS NOS type I nNOS NOS1_HUMAN Neuronal nitric oxide synthase Nitric oxide synthase, neuronal (nNOS) bNOS | nNOS
Type:
Homodimer
Mol. Mass.:
160985.98
Organism:
Homo sapiens (Human)
Description:
P29475
Residue:
1434
  
Inhibitor
Name:
BDBM50090926
Synonyms:
(2S)-2-amino-N-(4-aminobutyl)-5-{[(E)-imino(nitroamino)methyl]amino}pentanamide L-Arg NO2-NH-(CH2)4-NH2
Type:
Small organic molecule
Emp. Form.:
C10H23N7O3
Mol. Mass.:
289.3347
SMILES:
NCCCCNC(=O)[C@@H](N)CCCNC(=N)N[N+]([O-])=O
: