Target
Trypanothione reductase
Ligand
BDBM50369578
Substrate
Meas. Tech.
ChEMBL_211806 (CHEMBL811878)
Ki
2980±n/a nM
Citation
 Khan, MOAustin, SEChan, CYin, HMarks, DVaghjiani, SNKendrick, HYardley, VCroft, SLDouglas, KT Use of an additional hydrophobic binding site, the Z site, in the rational drug design of a new class of stronger trypanothione reductase inhibitor, quaternary alkylammonium phenothiazines. J Med Chem 43:3148-56 (2000)  
Target
Name:
Trypanothione reductase
Synonyms:
N(1),N(8)-bis(glutathionyl)spermidine reductase TR | TYTR_TRYCR
Type:
Homodimer; oxidoreductase
Mol. Mass.:
53868.26
Organism:
Trypanosoma cruzi
Description:
Residue:
492
  
Inhibitor
Name:
BDBM50369578
Synonyms:
CHEMBL239370
Type:
Small organic molecule
Emp. Form.:
C24H25ClN3O2S
Mol. Mass.:
454.992
SMILES:
C[N+](C)(CCCN1c2ccccc2Sc2ccc(Cl)cc12)Cc1ccc(cc1)[N+]([O-])=O
: