Target
Androgen receptor
Ligand
BDBM8885
Substrate
Meas. Tech.
ChEMBL_36428 (CHEMBL649839)
Ki
1.4±n/a nM
Citation
 Van Dort, MERobins, DMWayburn, B Design, synthesis, and pharmacological characterization of 4-[4, 4-dimethyl-3-(4-hydroxybutyl)-5-oxo-2-thioxo-1-imidazolidinyl]- 2-iodobenzonitrile as a high-affinity nonsteroidal androgen receptor ligand. J Med Chem 43:3344-7 (2000)  
Target
Name:
Androgen receptor
Synonyms:
ANDR_RAT Ar Nr3c4 | androgen
Type:
Enzyme
Mol. Mass.:
98219.08
Organism:
Rattus norvegicus (Rat)
Description:
P15207
Residue:
902
  
Inhibitor
Name:
BDBM8885
Synonyms:
(1S,2R,10R,11S,14S,15S)-14-hydroxy-2,15-dimethyltetracyclo[8.7.0.0^{2,7}.0^{11,15}]heptadec-6-en-5-one Testosterone US9682960, Testosterone
Type:
Steroid
Emp. Form.:
C19H28O2
Mol. Mass.:
288.4244
SMILES:
[H][C@@]12CC[C@H](O)[C@@]1(C)CC[C@@]1([H])[C@@]2([H])CCC2=CC(=O)CC[C@]12C
: