Target
Adenosine receptor A1
Ligand
BDBM50369061
Substrate
Meas. Tech.
ChEMBL_29141 (CHEMBL637712)
Ki
595±n/a nM
Citation
 Vittori, SLorenzen, AStannek, CCostanzi, SVolpini, RIJzerman, APKunzel, JKCristalli, G N-cycloalkyl derivatives of adenosine and 1-deazaadenosine as agonists and partial agonists of the A(1) adenosine receptor. J Med Chem 43:250-60 (2000)  
Target
Name:
Adenosine receptor A1
Synonyms:
AA1R_RAT ADENOSINE A1 high Adenosine A1 receptor (A1) Adenosine receptors A1 | Adora1
Type:
Protein
Mol. Mass.:
36704.13
Organism:
Rattus norvegicus (rat)
Description:
Residue:
326
  
Inhibitor
Name:
BDBM50369061
Synonyms:
CHEMBL604965
Type:
Small organic molecule
Emp. Form.:
C19H27ClN4O4
Mol. Mass.:
410.895
SMILES:
OC[C@H]1OC([C@H](O)[C@@H]1O)n1cnc2c(NC3CCCCCCC3)cc(Cl)nc12
: