Target
Cholecystokinin receptor type A
Ligand
BDBM50092568
Substrate
Meas. Tech.
ChEMBL_50190 (CHEMBL662405)
IC50
98±n/a nM
Citation
 Martín-Martínez, MDe La Figuera, NLatorre, MHerranz, RGarcía-López, MTCenarruzabeitia, EDel Río, JGonzález-Muñiz, R beta-Turned dipeptoids as potent and selective CCK(1) receptor antagonists. J Med Chem 43:3770-7 (2000)  
Target
Name:
Cholecystokinin receptor type A
Synonyms:
CCKAR_RAT Cholecystokinin peripheral Cholecystokinin receptor type A
Type:
Enzyme Catalytic Domain
Mol. Mass.:
49676.37
Organism:
RAT
Description:
Cholecystokinin central 0 RAT::P30551
Residue:
444
  
Inhibitor
Name:
BDBM50092568
Synonyms:
(2R,5R,11bS,1'S)-3-[(2-Benzyloxycarbonylamino-3-oxo-2,3,5,6,11,11b-hexahydro-1H-indolizino[8,7-b]indole-5-carbonyl)-amino]-4-phenyl-butyric acid | CHEMBL262463
Type:
Small organic molecule
Emp. Form.:
C33H32N4O6
Mol. Mass.:
580.6304
SMILES:
OC(=O)C[C@H](Cc1ccccc1)NC(=O)[C@H]1Cc2c([nH]c3ccccc23)[C@@H]2C[C@@H](NC(=O)OCc3ccccc3)C(=O)N12
: