Target
Carbonic anhydrase 2
Ligand
BDBM50094450
Substrate
Meas. Tech.
ChEMBL_45236 (CHEMBL657194)
Ki
0.9±n/a nM
Citation
 Scozzafava, AMenabuoni, LMincione, FBriganti, FMincione, GSupuran, CT Carbonic anhydrase inhibitors: perfluoroalkyl/aryl-substituted derivatives of aromatic/heterocyclic sulfonamides as topical intraocular pressure-lowering agents with prolonged duration of action. J Med Chem 43:4542-51 (2000)  
Target
Name:
Carbonic anhydrase 2
Synonyms:
CA-II CAC Carbonate dehydratase II Carbonic anhydrase 2 (CA-II) Carbonic anhydrase C Carbonic anhydrase II (CA-II) Carbonic anhydrase II (hCA II) | Carbonic anhydrase isoenzyme II (hCA II)
Type:
Enzyme
Mol. Mass.:
29250.71
Organism:
Homo sapiens (Human)
Description:
P00918
Residue:
260
  
Inhibitor
Name:
BDBM50094450
Synonyms:
6-Trifluoromethanesulfonylamino-benzothiazole-2-sulfonic acid amide | CHEMBL141351
Type:
Small organic molecule
Emp. Form.:
C8H6F3N3O4S3
Mol. Mass.:
361.341
SMILES:
NS(=O)(=O)c1nc2ccc(NS(=O)(=O)C(F)(F)F)cc2s1
: