Target
Acetylcholinesterase
Ligand
BDBM50369748
Substrate
Meas. Tech.
ChEMBL_28153 (CHEMBL644108)
IC50
0.75±n/a nM
Citation
 Camps, PEl Achab R, naMorral, JMuñoz-Torrero, DBadia, ABaños, JEVivas, NMBarril, XOrozco, MLuque, FJ New tacrine-huperzine A hybrids (huprines): highly potent tight-binding acetylcholinesterase inhibitors of interest for the treatment of Alzheimer's disease. J Med Chem 43:4657-66 (2001)  
Target
Name:
Acetylcholinesterase
Synonyms:
ACES_HUMAN Acetylcholinesterase (AChE) | Acetylcholinesterase (human AChE)
Type:
Enzyme
Mol. Mass.:
67792.70
Organism:
Homo sapiens (Human)
Description:
P22303
Residue:
614
  
Inhibitor
Name:
BDBM50369748
Synonyms:
CHEMBL208599
Type:
Small organic molecule
Emp. Form.:
C18H19ClN2
Mol. Mass.:
298.81
SMILES:
CCC1=CC2C[C@H](C1)c1c(C2)nc2cc(Cl)ccc2c1N
: