Target
Neutrophil collagenase
Ligand
BDBM50084665
Substrate
Meas. Tech.
ChEMBL_105808 (CHEMBL717808)
IC50
2±n/a nM
Citation
 Leung, DAbbenante, GFairlie, DP Protease inhibitors: current status and future prospects. J Med Chem 43:305-41 (2000)  
Target
Name:
Neutrophil collagenase
Synonyms:
CLG1 MMP8 Matrix metalloproteinase-8 PMNL collagenase | PMNL-CL
Type:
Enzyme
Mol. Mass.:
53413.48
Organism:
Homo sapiens (Human)
Description:
P22894
Residue:
467
  
Inhibitor
Name:
BDBM50084665
Synonyms:
CHEMBL115189 | N*4*-(2,2-Dimethyl-1-methylcarbamoyl-propyl)-2,N*1*-dihydroxy-3-isobutyl-succinamide(Marimisant)
Type:
Small organic molecule
Emp. Form.:
C15H29N3O5
Mol. Mass.:
331.4079
SMILES:
CNC(=O)C(NC(=O)[C@H](CC(C)C)[C@H](O)C(=O)NO)C(C)(C)C
: