Target
Plasminogen
Ligand
BDBM50063698
Substrate
Meas. Tech.
ChEMBL_222783 (CHEMBL884896)
IC50
2900±n/a nM
Citation
 Leung, DAbbenante, GFairlie, DP Protease inhibitors: current status and future prospects. J Med Chem 43:305-41 (2000)  
Target
Name:
Plasminogen
Synonyms:
Activation peptide PLG Plasmin Plasmin heavy chain A, short form | Plasmin light chain B
Type:
Enzyme
Mol. Mass.:
90579.18
Organism:
Homo sapiens (Human)
Description:
Residue:
810
  
Inhibitor
Name:
BDBM50063698
Synonyms:
4-Guanidino-benzoic acid 6-carbamimidoyl-naphthalen-2-yl ester CHEMBL273264 | Nafamostat
Type:
Small organic molecule
Emp. Form.:
C19H17N5O2
Mol. Mass.:
347.3706
SMILES:
[#7]\[#6](-[#7])=[#7]/c1ccc(cc1)-[#6](=O)-[#8]-c1ccc2cc(ccc2c1)-[#6](-[#7])=[#7]
: