Target
Kappa-type opioid receptor
Ligand
BDBM50021347
Substrate
Meas. Tech.
ChEMBL_145955 (CHEMBL752204)
Ki
57±n/a nM
Citation
 Subramanian, GPaterlini, MGPortoghese, PSFerguson, DM Molecular docking reveals a novel binding site model for fentanyl at the mu-opioid receptor. J Med Chem 43:381-91 (2000)  
Target
Name:
Kappa-type opioid receptor
Synonyms:
K-OR-1 Kappa-opioid receptor (KOR) Kappa-type opioid receptor (KOR) OPIATE Kappa OPRK1 kappa opioid receptor (KOR)
Type:
G Protein-Coupled Receptor (GPCR)
Mol. Mass.:
42648.76
Organism:
Homo sapiens (Human)
Description:
P41145
Residue:
380
  
Inhibitor
Name:
BDBM50021347
Synonyms:
CHEMBL12391 N-(3-Methyl-1-phenethyl-piperidin-4-yl)-N-phenyl-propionamide((3R,4S)-cis-3-methylfentanyl)
Type:
Small organic molecule
Emp. Form.:
C23H30N2O
Mol. Mass.:
350.4971
SMILES:
CCC(=O)N([C@H]1CCN(CCc2ccccc2)C[C@H]1C)c1ccccc1
: