Target
Kappa-type opioid receptor
Ligand
BDBM50033532
Substrate
Meas. Tech.
ChEMBL_145955 (CHEMBL752204)
Ki
>500±n/a nM
Citation
 Subramanian, GPaterlini, MGPortoghese, PSFerguson, DM Molecular docking reveals a novel binding site model for fentanyl at the mu-opioid receptor. J Med Chem 43:381-91 (2000)  
Target
Name:
Kappa-type opioid receptor
Synonyms:
K-OR-1 Kappa-opioid receptor (KOR) Kappa-type opioid receptor (KOR) OPIATE Kappa OPRK1 kappa opioid receptor (KOR)
Type:
G Protein-Coupled Receptor (GPCR)
Mol. Mass.:
42648.76
Organism:
Homo sapiens (Human)
Description:
P41145
Residue:
380
  
Inhibitor
Name:
BDBM50033532
Synonyms:
CHEMBL435380 N-[1-(2-Hydroxy-2-phenyl-ethyl)-3-methyl-piperidin-4-yl]-N-phenyl-propionamide(2'R,3S,4R)-cis-ohmefentanyl
Type:
Small organic molecule
Emp. Form.:
C23H30N2O2
Mol. Mass.:
366.4965
SMILES:
CCC(=O)N([C@@H]1CCN(C[C@H](O)c2ccccc2)C[C@@H]1C)c1ccccc1
: