Target
Neprilysin
Ligand
BDBM50064109
Substrate
Meas. Tech.
ChEMBL_140876 (CHEMBL752507)
IC50
5±n/a nM
Citation
 De Lombaert, SBlanchard, LStamford, LBTan, JWallace, EMSatoh, YFitt, JHoyer, DSimonsbergen, DMoliterni, JMarcopoulos, NSavage, PChou, MTrapani, AJJeng, AY Potent and selective non-peptidic inhibitors of endothelin-converting enzyme-1 with sustained duration of action. J Med Chem 43:488-504 (2000)  
Target
Name:
Neprilysin
Synonyms:
Mme Neprilysin Neutral endopeptidase 24.11
Type:
Protein
Mol. Mass.:
85789.59
Organism:
Rattus norvegicus (Rat)
Description:
P07861
Residue:
750
  
Inhibitor
Name:
BDBM50064109
Synonyms:
CGS-31447 {1-[(S)-2-Biphenyl-4-yl-1-(2H-tetrazol-5-yl)-ethylamino]-3-naphthalen-1-yl-propyl}-phosphonic acid {1-[2-Biphenyl-4-yl-1-(1H-tetrazol-5-yl)-ethylamino]-3-naphthalen-1-yl-propyl}-phosphonic acid(CGS-31,447)
Type:
Small organic molecule
Emp. Form.:
C28H28N5O3P
Mol. Mass.:
513.5274
SMILES:
OP(O)(=O)C(CCc1cccc2ccccc12)N[C@@H](Cc1ccc(cc1)-c1ccccc1)c1nnn[nH]1
: