Target
Leukotriene A-4 hydrolase
Ligand
BDBM50085263
Substrate
Meas. Tech.
ChEMBL_96941 (CHEMBL879999)
IC50
100±n/a nM
Citation
 Penning, TDChandrakumar, NSChen, BBChen, HYDesai, BNDjuric, SWDocter, SHGasiecki, AFHaack, RAMiyashiro, JMRussell, MAYu, SSCorley, DGDurley, RCKilpatrick, BFParnas, BLAskonas, LJGierse, JKHarding, EIHighkin, MKKachur, JFKim, SHKrivi, GGVillani-Price, DPyla, EYSmith, WG Structure-activity relationship studies on 1-[2-(4-Phenylphenoxy)ethyl]pyrrolidine (SC-22716), a potent inhibitor of leukotriene A(4) (LTA(4)) hydrolase. J Med Chem 43:721-35 (2000)  
Target
Name:
Leukotriene A-4 hydrolase
Synonyms:
LKHA4_HUMAN LTA4 Leukotriene A(4) hydrolase Leukotriene A4 hydrolase
Type:
Hydrolase; metalloprotease
Mol. Mass.:
69280.41
Organism:
Homo sapiens (Human)
Description:
Human recombinant LTA4H.
Residue:
611
  
Inhibitor
Name:
BDBM50085263
Synonyms:
2-[2-(4-Benzyl-phenoxy)-ethyl]-2-aza-bicyclo[2.2.2]oct-5-ene | CHEMBL350586
Type:
Small organic molecule
Emp. Form.:
C22H25NO
Mol. Mass.:
319.44
SMILES:
C(CN1CC2CCC1C=C2)Oc1ccc(Cc2ccccc2)cc1
: