Target
Leukotriene A-4 hydrolase
Ligand
BDBM50085271
Substrate
Meas. Tech.
ChEMBL_96941 (CHEMBL879999)
IC50
9700±n/a nM
Citation
 Penning, TDChandrakumar, NSChen, BBChen, HYDesai, BNDjuric, SWDocter, SHGasiecki, AFHaack, RAMiyashiro, JMRussell, MAYu, SSCorley, DGDurley, RCKilpatrick, BFParnas, BLAskonas, LJGierse, JKHarding, EIHighkin, MKKachur, JFKim, SHKrivi, GGVillani-Price, DPyla, EYSmith, WG Structure-activity relationship studies on 1-[2-(4-Phenylphenoxy)ethyl]pyrrolidine (SC-22716), a potent inhibitor of leukotriene A(4) (LTA(4)) hydrolase. J Med Chem 43:721-35 (2000)  
Target
Name:
Leukotriene A-4 hydrolase
Synonyms:
LKHA4_HUMAN LTA4 Leukotriene A(4) hydrolase Leukotriene A4 hydrolase
Type:
Hydrolase; metalloprotease
Mol. Mass.:
69280.41
Organism:
Homo sapiens (Human)
Description:
Human recombinant LTA4H.
Residue:
611
  
Inhibitor
Name:
BDBM50085271
Synonyms:
1-[2-(4-Benzyl-benzenesulfinyl)-ethyl]-pyrrolidine | CHEMBL354015
Type:
Small organic molecule
Emp. Form.:
C19H23NOS
Mol. Mass.:
313.457
SMILES:
O=S(CCN1CCCC1)c1ccc(Cc2ccccc2)cc1
: