Target
P2Y purinoceptor 1
Ligand
BDBM50118238
Substrate
Meas. Tech.
ChEMBL_222620 (CHEMBL846295)
IC50
51.60±n/a nM
Citation
 Nandanan, EJang, SYMoro, SKim, HOSiddiqui, MARuss, PMarquez, VEBusson, RHerdewijn, PHarden, TKBoyer, JLJacobson, KA Synthesis, biological activity, and molecular modeling of ribose-modified deoxyadenosine bisphosphate analogues as P2Y(1) receptor ligands. J Med Chem 43:829-42 (2000)  
Target
Name:
P2Y purinoceptor 1
Synonyms:
P2RY1 | P2RY1_MELGA
Type:
Mol. Mass.:
41199.64
Organism:
Meleagris gallopavo
Description:
Residue:
362
  
Inhibitor
Name:
BDBM50118238
Synonyms:
CHEMBL339873 | MRS 2279
Type:
Small organic molecule
Emp. Form.:
C13H18ClN5O8P2
Mol. Mass.:
469.711
SMILES:
CNc1nc(Cl)nc2n(cnc12)[C@H]1CC(OP(O)(O)=O)C2(COP(O)(O)=O)CC12
: