Target
Neprilysin
Ligand
BDBM50087088
Substrate
Meas. Tech.
ChEMBL_140761 (CHEMBL748035)
Ki
1.4±n/a nM
Citation
 Chen, HNoble, FMothé, AMeudal, HCoric, PDanascimento, SRoques, BPGeorge, PFournié-Zaluski, MC Phosphinic derivatives as new dual enkephalin-degrading enzyme inhibitors: synthesis, biological properties, and antinociceptive activities. J Med Chem 43:1398-408 (2001)  
Target
Name:
Neprilysin
Synonyms:
Atriopeptidase CD_antigen=CD10 MME NEP_RABIT Neutral endopeptidase 24.11
Type:
Enzyme
Mol. Mass.:
85570.75
Organism:
Oryctolagus cuniculus (rabbit)
Description:
NEP was purified to homogeneity from rabbit kidney.
Residue:
750
  
Inhibitor
Name:
BDBM50087088
Synonyms:
(2S)-2-[(2S)-3-[(1-azaniumylethyl)(hydroxy)phosphoryl]-2-[(4-phenylphenyl)methyl]propanamido]propanoic acid | 1-{[3-Biphenyl-4-yl-2-(1-carboxy-ethylcarbamoyl)-propyl]-hydroxy-phosphinoyl}-ethyl-ammonium
Type:
Small organic molecule
Emp. Form.:
C21H28N2O5P
Mol. Mass.:
419.4306
SMILES:
CC([NH3+])P(O)(=O)C[C@@H](Cc1ccc(cc1)-c1ccccc1)C(=O)N[C@@H](C)C(O)=O
: