Target
Angiotensin-converting enzyme
Ligand
BDBM50087111
Substrate
Meas. Tech.
ChEMBL_35385 (CHEMBL647301)
Ki
13000±n/a nM
Citation
 Chen, HNoble, FMothé, AMeudal, HCoric, PDanascimento, SRoques, BPGeorge, PFournié-Zaluski, MC Phosphinic derivatives as new dual enkephalin-degrading enzyme inhibitors: synthesis, biological properties, and antinociceptive activities. J Med Chem 43:1398-408 (2001)  
Target
Name:
Angiotensin-converting enzyme
Synonyms:
ACE_RAT Angiotensin-converting enzyme | Dcp1
Type:
PROTEIN
Mol. Mass.:
150907.81
Organism:
Rattus norvegicus
Description:
ChEMBL_35219
Residue:
1313
  
Inhibitor
Name:
BDBM50087111
Synonyms:
(2S)-2-[(2S)-3-{[(S)-azaniumyl(phenyl)methyl](hydroxy)phosphoryl}-2-benzylpropanamido]-3-phenylpropanoic acid | C-{[2-(1-Carboxy-2-phenyl-ethylcarbamoyl)-3-phenyl-propyl]-hydroxy-phosphinoyl}-C-phenyl-methyl-ammonium
Type:
Small organic molecule
Emp. Form.:
C26H30N2O5P
Mol. Mass.:
481.5
SMILES:
[NH3+][C@H](c1ccccc1)P(O)(=O)C[C@@H](Cc1ccccc1)C(=O)N[C@@H](Cc1ccccc1)C(O)=O
: