Target
Aminopeptidase N
Ligand
BDBM50087115
Substrate
Meas. Tech.
ChEMBL_28885 (CHEMBL646583)
Ki
17±n/a nM
Citation
 Chen, HNoble, FMothé, AMeudal, HCoric, PDanascimento, SRoques, BPGeorge, PFournié-Zaluski, MC Phosphinic derivatives as new dual enkephalin-degrading enzyme inhibitors: synthesis, biological properties, and antinociceptive activities. J Med Chem 43:1398-408 (2001)  
Target
Name:
Aminopeptidase N
Synonyms:
AMPN_PIG AP-M Alanyl aminopeptidase Aminopeptidase N (APN) Microsomal aminopeptidase pAPN
Type:
Protein
Mol. Mass.:
108810.25
Organism:
Sus scrofa (Pig)
Description:
P15145
Residue:
963
  
Inhibitor
Name:
BDBM50087115
Synonyms:
1-{[3-Biphenyl-4-yl-2-(1-carboxy-2-phenyl-ethylcarbamoyl)-propyl]-hydroxy-phosphinoyl}-2-phenyl-ethyl-ammonium
Type:
Small organic molecule
Emp. Form.:
C33H36N2O5P
Mol. Mass.:
571.6226
SMILES:
[NH3+]C(Cc1ccccc1)P(O)(=O)C[C@@H](Cc1ccc(cc1)-c1ccccc1)C(=O)N[C@@H](Cc1ccccc1)C(O)=O
: