Target
Neprilysin
Ligand
BDBM50087110
Substrate
Meas. Tech.
ChEMBL_140761 (CHEMBL748035)
Ki
15.5±n/a nM
Citation
 Chen, HNoble, FMothé, AMeudal, HCoric, PDanascimento, SRoques, BPGeorge, PFournié-Zaluski, MC Phosphinic derivatives as new dual enkephalin-degrading enzyme inhibitors: synthesis, biological properties, and antinociceptive activities. J Med Chem 43:1398-408 (2001)  
Target
Name:
Neprilysin
Synonyms:
Atriopeptidase CD_antigen=CD10 MME NEP_RABIT Neutral endopeptidase 24.11
Type:
Enzyme
Mol. Mass.:
85570.75
Organism:
Oryctolagus cuniculus (rabbit)
Description:
NEP was purified to homogeneity from rabbit kidney.
Residue:
750
  
Inhibitor
Name:
BDBM50087110
Synonyms:
1-{[2-(1-Carboxy-ethylcarbamoyl)-3-(4-isopropyl-phenyl)-propyl]-hydroxy-phosphinoyl}-ethyl-ammonium
Type:
Small organic molecule
Emp. Form.:
C18H30N2O5P
Mol. Mass.:
385.4144
SMILES:
CC(C)c1ccc(C[C@H](CP(O)(=O)C(C)[NH3+])C(=O)N[C@@H](C)C(O)=O)cc1
: