Target
Mu-type opioid receptor
Ligand
BDBM50087456
Substrate
Meas. Tech.
ChEMBL_148370 (CHEMBL873929)
Ki
0.16±n/a nM
Citation
 Larson, DLJones, RMHjorth, SASchwartz, TWPortoghese, PS Binding of norbinaltorphimine (norBNI) congeners to wild-type and mutant mu and kappa opioid receptors: molecular recognition loci for the pharmacophore and address components of kappa antagonists. J Med Chem 43:1573-6 (2000)  
Target
Name:
Mu-type opioid receptor
Synonyms:
M-OR-1 MOR-1 MUOR1 Mu opiate receptor OPRM1 hMOP | mu-type opioid receptor isoform MOR-1
Type:
G Protein-Coupled Receptor (GPCR)
Mol. Mass.:
44789.51
Organism:
Homo sapiens (Human)
Description:
P35372
Residue:
400
  
Inhibitor
Name:
BDBM50087456
Synonyms:
17-Methyl-17'-cyclopropylmethyl-3'-hydroxy-6,6',7,7'-tetradehydro-4,5 alpha : 4',5' alpha-diepoxy-6,6'-(imino)[7,7'-bimorphinan]-3,14'-diol
Type:
Small organic molecule
Emp. Form.:
C37H39N3O5
Mol. Mass.:
605.7227
SMILES:
CN1CC[C@@]23[C@H]4Oc5c2c(CC1[C@@H]3Cc1c2C[C@@]3(O)C6Cc7ccc(O)c8O[C@@H](c2[nH]c41)[C@]3(CCN6CC1CC1)c78)ccc5O
: