Target
Mu-type opioid receptor
Ligand
BDBM50026888
Substrate
Meas. Tech.
ChEMBL_145581 (CHEMBL749726)
EC50
0.600000±n/a nM
Citation
 Coop, ANorton, CLBerzetei-Gurske, IBurnside, JToll, LHusbands, SMLewis, JW Structural determinants of opioid activity in the orvinols and related structures: ethers of orvinol and isoorvinol. J Med Chem 43:1852-7 (2000)  
Target
Name:
Mu-type opioid receptor
Synonyms:
M-OR-1 MOR-1 MUOR1 Mu opiate receptor OPRM1 hMOP | mu-type opioid receptor isoform MOR-1
Type:
G Protein-Coupled Receptor (GPCR)
Mol. Mass.:
44789.51
Organism:
Homo sapiens (Human)
Description:
P35372
Residue:
400
  
Inhibitor
Name:
BDBM50026888
Synonyms:
CHEMBL2113671
Type:
Small organic molecule
Emp. Form.:
C29H33NO4
Mol. Mass.:
459.5766
SMILES:
[H][C@](C)(OCc1ccccc1)[C@]1([H])C[C@]23C=C[C@]1(OC)[C@@]1([H])Oc4c5c(C[C@@]2([H])N(C)CCC315)ccc4O
: