Target
Protein kinase C delta type
Ligand
BDBM50099646
Substrate
Meas. Tech.
ChEMBL_153135 (CHEMBL759074)
Ki
0.15±n/a nM
Citation
 Pak, YEnyedy, IJVarady, JKung, JWLorenzo, PSBlumberg, PMWang, S Structural basis of binding of high-affinity ligands to protein kinase C: prediction of the binding modes through a new molecular dynamics method and evaluation by site-directed mutagenesis. J Med Chem 44:1690-701 (2001)  
Target
Name:
Protein kinase C delta type
Synonyms:
KPCD_MOUSE Prkcd Protein kinase C delta type | nPKC-delta
Type:
PROTEIN
Mol. Mass.:
77554.99
Organism:
Mus musculus
Description:
ChEMBL_1351519
Residue:
674
  
Inhibitor
Name:
BDBM50099646
Synonyms:
5,6-dihydroxy-7-hydroxymethyl-3,11,11,14-tetramethyl-15-oxo-4-phenylcarbonyloxy-(14R)-tetracyclo[7.5.1.01,5.010,12]pentadeca-2,7-diene Ingenol-3-bezoate
Type:
Small organic molecule
Emp. Form.:
C27H32O6
Mol. Mass.:
452.5394
SMILES:
C[C@@H]1C[C@@H]2[C@H]([C@@H]3C=C(CO)[C@@H](O)[C@]4(O)[C@@H](OC(=O)c5ccccc5)C(C)=CC14C3=O)C2(C)C
: