Target
Protein kinase C delta type
Ligand
BDBM50057511
Substrate
Meas. Tech.
ChEMBL_153142 (CHEMBL759081)
Ki
2.01±n/a nM
Citation
 Pak, YEnyedy, IJVarady, JKung, JWLorenzo, PSBlumberg, PMWang, S Structural basis of binding of high-affinity ligands to protein kinase C: prediction of the binding modes through a new molecular dynamics method and evaluation by site-directed mutagenesis. J Med Chem 44:1690-701 (2001)  
Target
Name:
Protein kinase C delta type
Synonyms:
KPCD_MOUSE Prkcd Protein kinase C delta type | nPKC-delta
Type:
PROTEIN
Mol. Mass.:
77554.99
Organism:
Mus musculus
Description:
ChEMBL_1351519
Residue:
674
  
Inhibitor
Name:
BDBM50057511
Synonyms:
(+/-)-indolactum-V 13-Hydroxymethyl-10-isopropyl-9-methyl-3,9,12-triaza-tricyclo[6.6.1.0*4,15*]pentadeca-1,4,6,8(15)-tetraen-11-one (10S,13S)-13-Hydroxymethyl-10-isopropyl-9-methyl-3,9,12-triaza-tricyclo[6.6.1.0*4,15*]pentadeca-1,4(15),5,7-tetraen-11-one (2S,5S)-5-(hydroxymethyl)-2-isopropyl-1-methyl-1,2,5,6-tetrahydro-4H-[1,4]diazonino[7,6,5-cd]indol-3(8H)-one 13-Hydroxymethyl-10-isopropyl-9-methyl-3,9,12-triaza-tricyclo[6.6.1.0*4,15*]pentadeca-1,4(15),5,7-tetraen-11-one CHEMBL27266 indolactam-V
Type:
Small organic molecule
Emp. Form.:
C17H23N3O2
Mol. Mass.:
301.3834
SMILES:
CC(C)[C@@H]1N(C)c2cccc3[nH]cc(C[C@@H](CO)NC1=O)c23
: