Target
Melanocyte-stimulating hormone receptor
Ligand
BDBM50100758
Substrate
Meas. Tech.
ChEMBL_219174 (CHEMBL821685)
EC50
0.034±n/a nM
Citation
 Haskell-Luevano, CHolder, JRMonck, EKBauzo, RM Characterization of melanocortin NDP-MSH agonist peptide fragments at the mouse central and peripheral melanocortin receptors. J Med Chem 44:2247-52 (2001)  
Target
Name:
Melanocyte-stimulating hormone receptor
Synonyms:
MC1-R Mc1r Melanocyte-stimulating hormone receptor | Msh-r
Type:
PROTEIN
Mol. Mass.:
35238.60
Organism:
Mus musculus
Description:
ChEMBL_1498846
Residue:
315
  
Inhibitor
Name:
BDBM50100758
Synonyms:
Ac-Nle-Glu-His-DPhe-Arg-Trp-NH2 | CHEMBL267794
Type:
Small organic molecule
Emp. Form.:
C45H61N13O9
Mol. Mass.:
928.0475
SMILES:
CCCC[C@H](NC(C)=O)C(=O)N[C@@H](CCC(O)=O)C(=O)N[C@@H](Cc1cnc[nH]1)C(=O)N[C@H](Cc1ccccc1)C(=O)N[C@@H](CCCNC(N)=N)C(=O)N[C@@H](Cc1c[nH]c2ccccc12)C(N)=O
: