Target
Disintegrin and metalloproteinase domain-containing protein 17
Ligand
BDBM50102608
Substrate
Meas. Tech.
ChEMBL_222128 (CHEMBL822216)
Ki
4.2±n/a nM
Citation
 Xue, CBVoss, MENelson, DJDuan, JJCherney, RJJacobson, ICHe, XRoderick, JChen, LCorbett, RLWang, LMeyer, DTKennedy, KDeGradodagger, WFHardman, KDTeleha, CAJaffee, BDLiu, RQCopeland, RACovington, MBChrist, DDTrzaskos, JMNewton, RCMagolda, RLWexler, RRDecicco, CP Design, synthesis, and structure-activity relationships of macrocyclic hydroxamic acids that inhibit tumor necrosis factor alpha release in vitro and in vivo. J Med Chem 44:2636-60 (2001)  
Target
Name:
Disintegrin and metalloproteinase domain-containing protein 17
Synonyms:
A disintegrin and metalloproteinase domain 17 ADAM 17 Snake venom-like protease TNF-alpha-Converting Enzyme
Type:
Metalloprotease
Mol. Mass.:
12197.99
Organism:
Sus scrofa (pig)
Description:
Partially purified TACE was obtained from porcine spleen.
Residue:
112
  
Inhibitor
Name:
BDBM50102608
Synonyms:
11-Isobutyl-2,10-dioxo-1-oxa-3,9-diaza-cyclopentadecane-8,12-dicarboxylic acid 12-hydroxyamide 8-[(2-morpholin-4-yl-2-oxo-ethyl)-amide] CHEMBL91636
Type:
Small organic molecule
Emp. Form.:
C24H41N5O8
Mol. Mass.:
527.611
SMILES:
CC(C)C[C@@H]1[C@H](CCCOC(=O)NCCCC[C@H](NC1=O)C(=O)NCC(=O)N1CCOCC1)C(=O)NO
: