Target
Somatostatin receptor type 2
Ligand
BDBM50103430
Substrate
Meas. Tech.
ChEMBL_200685 (CHEMBL807097)
Ki
0.01±n/a nM
Citation
 Poitout, LRoubert, PContour-Galcéra, MOMoinet, CLannoy, JPommier, JPlas, PBigg, DThurieau, C Identification of potent non-peptide somatostatin antagonists with sst(3) selectivity. J Med Chem 44:2990-3000 (2001)  
Target
Name:
Somatostatin receptor type 2
Synonyms:
SOMATOSTATIN SST2 SS-2-R SS2R SSTR2 | Somatostatin receptor type 2 (SSTR2)
Type:
Enzyme
Mol. Mass.:
41344.94
Organism:
Homo sapiens (Human)
Description:
P30874
Residue:
369
  
Inhibitor
Name:
BDBM50103430
Synonyms:
6-Amino-2-(3-(1H-indol-3-yl)-2-{[4-(2-oxo-2,3-dihydro-benzoimidazol-1-yl)-piperidine-1-carbonyl]-amino}-butyrylamino)-hexanoic acid tert-butyl ester | CHEMBL99895
Type:
Small organic molecule
Emp. Form.:
C35H47N7O5
Mol. Mass.:
645.7916
SMILES:
C[C@H]([C@@H](NC(=O)N1CCC(CC1)n1c2ccccc2[nH]c1=O)C(=O)N[C@@H](CCCCN)C(=O)OC(C)(C)C)c1c[nH]c2ccccc12
: