Target
Mu-type opioid receptor
Ligand
BDBM50105093
Substrate
Meas. Tech.
ChEMBL_149489 (CHEMBL757060)
IC50
1470±n/a nM
Citation
 Poulain, RHorvath, DBonnet, BEckhoff, CChapelain, BBodinier, MCDéprez, B From hit to lead. Combining two complementary methods for focused library design. Application to mu opiate ligands. J Med Chem 44:3378-90 (2001)  
Target
Name:
Mu-type opioid receptor
Synonyms:
M-OR-1 MOR-1 MUOR1 Mu opiate receptor OPRM1 hMOP | mu-type opioid receptor isoform MOR-1
Type:
G Protein-Coupled Receptor (GPCR)
Mol. Mass.:
44789.51
Organism:
Homo sapiens (Human)
Description:
P35372
Residue:
400
  
Inhibitor
Name:
BDBM50105093
Synonyms:
4-Oxo-1-phenyl-1,3,8-triaza-spiro[4.5]decane-8-carboxylic acid indan-1-yl ester | CHEMBL325674
Type:
Small organic molecule
Emp. Form.:
C23H25N3O3
Mol. Mass.:
391.4629
SMILES:
O=C(OC1CCc2ccccc12)N1CCC2(CC1)N(CNC2=O)c1ccccc1
: