Target
Neprilysin
Ligand
BDBM50105262
Substrate
Meas. Tech.
ChEMBL_144640 (CHEMBL752997)
Ki
1.2±n/a nM
Citation
 Chen, HNoble, FRoques, BPFournié-Zaluski, MC Long lasting antinociceptive properties of enkephalin degrading enzyme (NEP and APN) inhibitor prodrugs. J Med Chem 44:3523-30 (2001)  
Target
Name:
Neprilysin
Synonyms:
Atriopeptidase CD_antigen=CD10 EPN MME NEP_HUMAN Neutral endopeptidase | Neutral endopeptidase 24.11
Type:
Enzyme
Mol. Mass.:
85505.38
Organism:
Homo sapiens (Human)
Description:
P08473
Residue:
750
  
Inhibitor
Name:
BDBM50105262
Synonyms:
2-{3-[(1-Amino-ethyl)-hydroxy-phosphinoyl]-2-biphenyl-4-ylmethyl-propionylamino}-propionic acid anion | CHEMBL420321
Type:
Small organic molecule
Emp. Form.:
C21H27N2O5P
Mol. Mass.:
418.4232
SMILES:
C[C@@H]([NH3+])P(O)(=O)C[C@H](Cc1ccc(cc1)-c1ccccc1)C(=O)N[C@@H](C)C([O-])=O
: