Target
Cholecystokinin receptor type A
Ligand
BDBM50106589
Substrate
Meas. Tech.
ChEMBL_50181 (CHEMBL662396)
IC50
13.8±n/a nM
Citation
 Bartolomé-Nebreda, JMGarcía-López, MTGonzález-Muñiz, RCenarruzabeitia, ELatorre, MDel Río, JHerranz, R 5-(Tryptophyl)amino-1,3-dioxoperhydropyrido[1,2-c]pyrimidine-based potent and selective CCK(1) receptor antagonists: structure-activity relationship studies on the central 1,3-dioxoperhydropyrido[1,2-c]pyrimidine scaffold. J Med Chem 44:4196-206 (2001)  
Target
Name:
Cholecystokinin receptor type A
Synonyms:
CCKAR_RAT Cholecystokinin peripheral Cholecystokinin receptor type A
Type:
Enzyme Catalytic Domain
Mol. Mass.:
49676.37
Organism:
RAT
Description:
Cholecystokinin central 0 RAT::P30551
Residue:
444
  
Inhibitor
Name:
BDBM50106589
Synonyms:
CHEMBL132467 | [1-(2-Benzyl-1-oxo-3-thioxo-octahydro-4a(R)-pyrido[1,2-c]pyrimidin-5(S)-ylcarbamoyl)-2-(1H-indol-3-yl)-ethyl]-carbamic acid tert-butyl ester
Type:
Small organic molecule
Emp. Form.:
C31H37N5O4S
Mol. Mass.:
575.722
SMILES:
CC(C)(C)OC(=O)NC(Cc1c[nH]c2ccccc12)C(=O)N[C@H]1CCCN2[C@@H]1CC(=S)N(Cc1ccccc1)C2=O
: