Target
Reverse transcriptase/RNaseH
Ligand
BDBM50102266
Substrate
Meas. Tech.
ChEMBL_196191 (CHEMBL803636)
Ki
29±n/a nM
Citation
 Campiani, GAiello, FFabbrini, MMorelli, ERamunno, AArmaroli, SNacci, VGarofalo, AGreco, GNovellino, EMaga, GSpadari, SBergamini, AVentura, LBongiovanni, BCapozzi, MBolacchi, FMarini, SColetta, MGuiso, GCaccia, S Quinoxalinylethylpyridylthioureas (QXPTs) as potent non-nucleoside HIV-1 reverse transcriptase (RT) inhibitors. Further SAR studies and identification of a novel orally bioavailable hydrazine-based antiviral agent. J Med Chem 44:305-15 (2001)  
Target
Name:
Reverse transcriptase/RNaseH
Synonyms:
HIV-1 Reverse Transcriptase RNase H Reverse transcriptase/RNaseH
Type:
PROTEIN
Mol. Mass.:
65229.15
Organism:
Human immunodeficiency virus 1
Description:
ChEMBL_1473730
Residue:
566
  
Inhibitor
Name:
BDBM50102266
Synonyms:
1-(5-Bromo-pyridin-2-yl)-3-[2-(7-fluoro-4-oxo-4H-pyrrolo[1,2-a]quinoxalin-5-yl)-ethyl]-thiourea | CHEMBL418812
Type:
Small organic molecule
Emp. Form.:
C19H15BrFN5OS
Mol. Mass.:
460.323
SMILES:
Fc1ccc2c(c1)n(CCNC(=S)Nc1ccc(Br)cn1)c(=O)c1cccn21
: