Target
Gonadotropin-releasing hormone receptor
Ligand
BDBM50102446
Substrate
Meas. Tech.
ChEMBL_71451 (CHEMBL684350)
IC50
5±n/a nM
Citation
 Jiang, GStalewski, JGalyean, RDykert, JSchteingart, CBroqua, PAebi, AAubert, MLSemple, GRobson, PAkinsanya, KHaigh, RRiviere, PTrojnar, JJunien, JLRivier, JE GnRH antagonists: a new generation of long acting analogues incorporating p-ureido-phenylalanines at positions 5 and 6. J Med Chem 44:453-67 (2001)  
Target
Name:
Gonadotropin-releasing hormone receptor
Synonyms:
GNRHR GRHR GnRH-R Gonadotropin-releasing hormone receptor | Gonadotropin-releasing hormone receptor (GnRH)
Type:
Enzyme
Mol. Mass.:
37749.45
Organism:
Homo sapiens (Human)
Description:
P30968
Residue:
328
  
Inhibitor
Name:
BDBM50102446
Synonyms:
Ac-D-Nal-[D-(pCl)Phe]-D-Pal-Ser-[Aph(EtCbm)]-D-[Aph(EtCbm)]-Leu-ILys-Pro-DAla-NH2 | CHEMBL268875
Type:
Small organic molecule
Emp. Form.:
C82H108ClN17O14
Mol. Mass.:
1591.293
SMILES:
CCNC(=O)Nc1ccc(C[C@H](NC(=O)[C@H](CO)NC(=O)[C@@H](Cc2cccnc2)NC(=O)[C@@H](Cc2ccc(Cl)cc2)NC(=O)[C@@H](Cc2ccc3ccccc3c2)NC(C)=O)C(=O)N[C@H](Cc2ccc(NC(=O)NCC)cc2)C(=O)N[C@@H](CC(C)C)C(=O)N[C@@H](CCCCNC(C)C)C(=O)N2CCC[C@H]2C(=O)N[C@H](C)C(N)=O)cc1
: