Target
Adenosine receptor A3
Ligand
BDBM50097440
Substrate
Meas. Tech.
ChEMBL_32009 (CHEMBL646606)
Ki
410±n/a nM
Citation
 van Muijlwijk-Koezen, JETimmerman, HVollinga, RCFrijtag von Drabbe Künzel, Jde Groote, MVisser, SIJzerman, AP Thiazole and thiadiazole analogues as a novel class of adenosine receptor antagonists. J Med Chem 44:749-62 (2001)  
Target
Name:
Adenosine receptor A3
Synonyms:
A3 adenosine receptor (hA3) ADORA3 | Adenosine A3 receptor (A3AR)
Type:
G Protein-Coupled Receptor (GPCR)
Mol. Mass.:
36197.32
Organism:
Homo sapiens (Human)
Description:
P0DMS8
Residue:
318
  
Inhibitor
Name:
BDBM50097440
Synonyms:
CHEMBL165783 | N-(3-Phenyl-[1,2,4]thiadiazol-5-yl)-benzamide
Type:
Small organic molecule
Emp. Form.:
C15H11N3OS
Mol. Mass.:
281.332
SMILES:
O=C(Nc1nc(ns1)-c1ccccc1)c1ccccc1
: