Target
M-phase inducer phosphatase 1
Ligand
BDBM50097546
Substrate
Meas. Tech.
ChEMBL_49008 (CHEMBL662888)
IC50
7800±n/a nM
Citation
 Peng, HXie, WOtterness, DMCogswell, JPMcConnell, RTCarter, HLPowis, GAbraham, RTZalkow, LH Syntheses and biological activities of a novel group of steroidal derived inhibitors for human Cdc25A protein phosphatase. J Med Chem 44:834-48 (2001)  
Target
Name:
M-phase inducer phosphatase 1
Synonyms:
CDC25A Dual specificity phosphatase Cdc25A MPIP1_HUMAN | phosphatase Cdc25
Type:
Protein
Mol. Mass.:
59090.18
Organism:
Homo sapiens (Human)
Description:
P30304
Residue:
524
  
Inhibitor
Name:
BDBM50097546
Synonyms:
Sulfuric acidmono-{5-furan-3-yl-2-methyl-1-[1-(2,5,5,8a-tetramethyl-1,4,4a,5,6,7,8,8a-octahydro-naphthalen-1-yl)-ethyl]-pentyl}ester(sulfircin)
Type:
Small organic molecule
Emp. Form.:
C26H41O5S
Mol. Mass.:
465.666
SMILES:
C[C@H](CCCc1ccoc1)[C@@H](OS([O-])(=O)=O)C(C)[C@H]1C(C)=CC[C@H]2C(C)(C)CCC[C@]12C
: