Target
Kappa-type opioid receptor
Ligand
BDBM50001707
Substrate
Meas. Tech.
ChEMBL_145831 (CHEMBL873915)
Ki
435±n/a nM
Citation
 Metzger, TGPaterlini, MGFerguson, DMPortoghese, PS Investigation of the selectivity of oxymorphone- and naltrexone-derived ligands via site-directed mutagenesis of opioid receptors: exploring the"address" recognition locus. J Med Chem 44:857-62 (2001)  
Target
Name:
Kappa-type opioid receptor
Synonyms:
KOR-1 OPIATE Kappa Opioid receptor Ror-d
Type:
G Protein-Coupled Receptor (GPCR)
Mol. Mass.:
42692.90
Organism:
Rattus norvegicus (rat)
Description:
P34975
Residue:
380
  
Inhibitor
Name:
BDBM50001707
Synonyms:
10,17-dihydroxy-4-methyl-(13R,17S)-12-oxa-4-azapentacyclo[9.6.1.01,13.05,17.07,18]octadeca-7(18),8,10-trien-14-one 10,17-dihydroxy-4-methyl-(13R,17S)-12-oxa-4-azapentacyclo[9.6.1.01,13.05,17.07,18]octadeca-7(18),8,10-trien-14-one(xymorphone) CHEMBL963 Combunox OXYMORPHONE Oxycet Percocet Roxicet Roxiprin Tylox-325
Type:
Small organic molecule
Emp. Form.:
C17H19NO4
Mol. Mass.:
301.3371
SMILES:
CN1CC[C@@]23[C@H]4Oc5c2c(C[C@@H]1[C@]3(O)CCC4=O)ccc5O
: